Reaction Details
TargetD(3) dopamine receptor
LigandBDBM50172506
Substrate/Competitorn/a
Meas. Tech.ChEMBL_320771 (CHEMBL884726)
Ki 8.4±n/a nM
Citation Elsner, JBoeckler, FHeinemann, FWHübner, HGmeiner, P Pharmacophore-guided drug discovery investigations leading to bioactive 5-aminotetrahydropyrazolopyridines. Implications for the binding mode of heterocyclic dopamine D3 receptor agonists. J Med Chem48:5771-9 (2005) 
 
D(3) dopamine receptor
Name:D(3) dopamine receptor
Type:n/a
Mol. Mass.:44243.43
Organism:Homo sapiens (Human)
Description:n/a
Residue:400
BDBM50172506
NameBDBM50172506
Synonyms:CHEMBL193337 | Dipropyl-(S)-4,5,6,7-tetrahydro-pyrazolo[1,5-a]pyridin-5-yl-amine
TypeSmall organic molecule
Emp. Form.C13H23N3
Mol. Mass.221.3418
SMILESCCCN(CCC)[C@H]1CCn2nccc2C1