Reaction Details
TargetcGMP-gated cation channel alpha-1
LigandBDBM50172537
Substrate/Competitorn/a
Meas. Tech.ChEMBL_320711 (CHEMBL881697)
Kd 74±n/a nM
Citation Strassmaier, TUma, RGhatpande, ASBandyopadhyay, TSchaffer, MWitte, JMcDougal, PGBrown, RLKarpen, JW Modifications to the tetracaine scaffold produce cyclic nucleotide-gated channel blockers with widely varying efficacies. J Med Chem48:5805-12 (2005) 
 
cGMP-gated cation channel alpha-1
Name:cGMP-gated cation channel alpha-1
Type:PROTEIN
Mol. Mass.:79603.33
Organism:Bos taurus
Description:ChEMBL_320711
Residue:690
BDBM50172537
NameBDBM50172537
Synonyms:(3-Amino-propyl)-[2-(4-butylamino-benzoyloxy)-ethyl]-dimethyl-ammonium | CHEMBL196995
TypeSmall organic molecule
Emp. Form.C18H33N3O2
Mol. Mass.323.4724
SMILESCCCCNc1ccc(cc1)C(=O)OCC[N+](C)(C)CCC[NH3+]