Reaction Details
TargetcGMP-gated cation channel alpha-1
LigandBDBM50172540
Substrate/Competitorn/a
Meas. Tech.ChEMBL_320710 (CHEMBL881696)
Kd 10000000±n/a nM
Citation Strassmaier, TUma, RGhatpande, ASBandyopadhyay, TSchaffer, MWitte, JMcDougal, PGBrown, RLKarpen, JW Modifications to the tetracaine scaffold produce cyclic nucleotide-gated channel blockers with widely varying efficacies. J Med Chem48:5805-12 (2005) 
 
cGMP-gated cation channel alpha-1
Name:cGMP-gated cation channel alpha-1
Type:PROTEIN
Mol. Mass.:79603.33
Organism:Bos taurus
Description:ChEMBL_320711
Residue:690
BDBM50172540
NameBDBM50172540
Synonyms:[2-(4-Amino-benzoyloxy)-ethyl]-dimethyl-ammonium
TypeSmall organic molecule
Emp. Form.C11H17N2O2
Mol. Mass.209.2643
SMILESC[NH+](C)CCOC(=O)c1ccc(N)cc1