Reaction Details
TargetcGMP-gated cation channel alpha-1
LigandBDBM50172536
Substrate/Competitorn/a
Meas. Tech.ChEMBL_320710 (CHEMBL881696)
Kd 5400±n/a nM
Citation Strassmaier, TUma, RGhatpande, ASBandyopadhyay, TSchaffer, MWitte, JMcDougal, PGBrown, RLKarpen, JW Modifications to the tetracaine scaffold produce cyclic nucleotide-gated channel blockers with widely varying efficacies. J Med Chem48:5805-12 (2005) 
 
cGMP-gated cation channel alpha-1
Name:cGMP-gated cation channel alpha-1
Type:PROTEIN
Mol. Mass.:79603.33
Organism:Bos taurus
Description:ChEMBL_320711
Residue:690
BDBM50172536
NameBDBM50172536
Synonyms:Butyl-[2-(4-butylamino-benzoyloxy)-ethyl]-dimethyl-ammonium | CHEMBL195005
TypeSmall organic molecule
Emp. Form.C19H33N2O2
Mol. Mass.321.477
SMILESCCCCNc1ccc(cc1)C(=O)OCC[N+](C)(C)CCCC