Reaction Details
TargetcGMP-gated cation channel alpha-1
LigandBDBM50172542
Substrate/Competitorn/a
Meas. Tech.ChEMBL_320711 (CHEMBL881697)
Kd 2500000±n/a nM
Citation Strassmaier, TUma, RGhatpande, ASBandyopadhyay, TSchaffer, MWitte, JMcDougal, PGBrown, RLKarpen, JW Modifications to the tetracaine scaffold produce cyclic nucleotide-gated channel blockers with widely varying efficacies. J Med Chem48:5805-12 (2005) 
 
cGMP-gated cation channel alpha-1
Name:cGMP-gated cation channel alpha-1
Type:PROTEIN
Mol. Mass.:79603.33
Organism:Bos taurus
Description:ChEMBL_320711
Residue:690
BDBM50172542
NameBDBM50172542
Synonyms:{2-[4-(4-Acetylamino-butylamino)-benzoyloxy]-ethyl}-dimethyl-ammonium
TypeSmall organic molecule
Emp. Form.C17H28N3O3
Mol. Mass.322.422
SMILESC[NH+](C)CCOC(=O)c1ccc(NCCCCNC(C)=O)cc1