Reaction Details
TargetAmyloid-beta precursor protein
LigandBDBM50173648
Substrate/Competitorn/a
Meas. Tech.ChEMBL_320894 (CHEMBL872393)
Ki 80±n/a nM
Citation Zhang, WOya, SKung, MPHou, CMaier, DLKung, HF F-18 stilbenes as PET imaging agents for detecting beta-amyloid plaques in the brain. J Med Chem48:5980-8 (2005) 
 
Amyloid-beta precursor protein
Name:Amyloid-beta precursor protein
Type:Single-pass type I membrane protein
Mol. Mass.:86890.41
Organism:Homo sapiens (Human)
Description:P05067
Residue:770
BDBM50173648
NameBDBM50173648
Synonyms:2-(4-Bromo-benzyl)-3-{4-[(E)-2-(4-dimethylamino-phenyl)-vinyl]-phenoxy}-propan-1-ol | CHEMBL196387
TypeSmall organic molecule
Emp. Form.C26H28BrNO2
Mol. Mass.466.41
SMILESCN(C)c1ccc(\C=C\c2ccc(OCC(CO)Cc3ccc(Br)cc3)cc2)cc1