Reaction Details
TargetMuscarinic acetylcholine receptor M1
LigandBDBM50370683
Substrate/Competitorn/a
Meas. Tech.ChEMBL_320891 (CHEMBL872390)
Ki 0.32±n/a nM
Citation Naito, RYonetoku, YOkamoto, YToyoshima, AIkeda, KTakeuchi, M Synthesis and antimuscarinic properties of quinuclidin-3-yl 1,2,3,4-tetrahydroisoquinoline-2-carboxylate derivatives as novel muscarinic receptor antagonists. J Med Chem48:6597-606 (2005) 
 
Muscarinic acetylcholine receptor M1
Name:Muscarinic acetylcholine receptor M1
Type:Enzyme Catalytic Domain
Mol. Mass.:51390.46
Organism:RAT
Description:P08482
Residue:460
BDBM50370683
NameBDBM50370683
Synonyms:CHEMBL1169543
TypeSmall organic molecule
Emp. Form.C23H26N2O2
Mol. Mass.362.4647
SMILESO=C(O[C@H]1CN2CCC1CC2)N1CCc2ccccc2[C@H]1c1ccccc1