Reaction Details
TargetPlasminogen
LigandBDBM50292271
Substrate/Competitorn/a
Meas. Tech.ChEMBL_321240 (CHEMBL881775)
IC50 2700±n/a nM
Citation Xue, FSeto, CT Selective inhibitors of the serine protease plasmin: probing the S3 and S3' subsites using a combinatorial library. J Med Chem48:6908-17 (2005) 
 
Plasminogen
Name:Plasminogen
Type:Enzyme
Mol. Mass.:90579.18
Organism:Homo sapiens (Human)
Description:n/a
Residue:810
BDBM50292271
NameBDBM50292271
Synonyms:CHEMBL265127 | Cyclohexanone derivative
TypeSmall organic molecule
Emp. Form.C68H74N12O14
Mol. Mass.1283.3872
SMILESCOC(=O)[C@@H](NC(=O)[C@@H](NC(=O)CC[C@H]1CCC[C@@H](NC(=O)[C@@H](NC(=O)[C@@H](NC(=O)OCc2ccccc2)C(=O)[C@@H](N)Cc2c[nH]c3ccccc23)C(=O)[C@@H](N)Cc2c[nH]c3ccccc23)C1=O)C(=O)[C@@H](N)Cc1c[nH]c2ccccc12)C(=O)[C@@H](N)Cc1ccc(O)cc1