Reaction Details
TargetSigma non-opioid intracellular receptor 1
LigandBDBM50179257
Substrate/Competitorn/a
Meas. Tech.ChEMBL_325587 (CHEMBL860170)
Ki 0.24±n/a nM
Citation Berardi, FFerorelli, SAbate, CPedone, MPColabufo, NAContino, MPerrone, R Methyl substitution on the piperidine ring of N-[omega-(6-methoxynaphthalen-1-yl)alkyl] derivatives as a probe for selective binding and activity at the sigma(1) receptor. J Med Chem48:8237-44 (2005) 
 
Sigma non-opioid intracellular receptor 1
Name:Sigma non-opioid intracellular receptor 1
Type:Protein
Mol. Mass.:25307.17
Organism:Cavia porcellus (Guinea pig)
Description:Q60492
Residue:223
BDBM50179257
NameBDBM50179257
Synonyms:(-)-(R)-1-(4-(6-methoxynaphthalen-1-yl)butyl)-3-methylpiperidine hydrochloride | CHEMBL539333
TypeSmall organic molecule
Emp. Form.C21H29NO
Mol. Mass.311.4611
SMILESCOc1ccc2c(CCCCN3CCC[C@@H](C)C3)cccc2c1