Reaction Details
TargetSigma non-opioid intracellular receptor 1
LigandBDBM50179262
Substrate/Competitorn/a
Meas. Tech.ChEMBL_325587 (CHEMBL860170)
Ki 0.3±n/a nM
Citation Berardi, FFerorelli, SAbate, CPedone, MPColabufo, NAContino, MPerrone, R Methyl substitution on the piperidine ring of N-[omega-(6-methoxynaphthalen-1-yl)alkyl] derivatives as a probe for selective binding and activity at the sigma(1) receptor. J Med Chem48:8237-44 (2005) 
 
Sigma non-opioid intracellular receptor 1
Name:Sigma non-opioid intracellular receptor 1
Type:Protein
Mol. Mass.:25307.17
Organism:Cavia porcellus (Guinea pig)
Description:Q60492
Residue:223
BDBM50179262
NameBDBM50179262
Synonyms:1-(4-(6-methoxy-1,2,3,4-tetrahydronaphthalen-1-yl)butyl)-4,4-dimethylpiperidine hydrochloride | CHEMBL540818
TypeSmall organic molecule
Emp. Form.C22H35NO
Mol. Mass.329.5194
SMILESCOc1ccc2C(CCCCN3CCC(C)(C)CC3)CCCc2c1