Reaction Details
Target3-beta-hydroxysteroid-Delta(8),Delta(7)-isomerase
LigandBDBM50179262
Substrate/Competitorn/a
Meas. Tech.ChEMBL_325589 (CHEMBL860172)
Ki 4.11±n/a nM
Citation Berardi, FFerorelli, SAbate, CPedone, MPColabufo, NAContino, MPerrone, R Methyl substitution on the piperidine ring of N-[omega-(6-methoxynaphthalen-1-yl)alkyl] derivatives as a probe for selective binding and activity at the sigma(1) receptor. J Med Chem48:8237-44 (2005) 
 
3-beta-hydroxysteroid-Delta(8),Delta(7)-isomerase
Name:3-beta-hydroxysteroid-Delta(8),Delta(7)-isomerase
Type:PROTEIN
Mol. Mass.:26684.52
Organism:Cavia porcellus
Description:ChEMBL_203193
Residue:229
BDBM50179262
NameBDBM50179262
Synonyms:1-(4-(6-methoxy-1,2,3,4-tetrahydronaphthalen-1-yl)butyl)-4,4-dimethylpiperidine hydrochloride | CHEMBL540818
TypeSmall organic molecule
Emp. Form.C22H35NO
Mol. Mass.329.5194
SMILESCOc1ccc2C(CCCCN3CCC(C)(C)CC3)CCCc2c1