Reaction Details
TargetCarbonic anhydrase 2
LigandBDBM50370690
Substrate/Competitorn/a
Meas. Tech.ChEMBL_326095 (CHEMBL869402)
Ki 80±n/a nM
Citation Cecchi, ATaylor, SDLiu, YHill, BVullo, DScozzafava, ASupuran, CT Carbonic anhydrase inhibitors: inhibition of the human isozymes I, II, VA, and IX with a library of substituted difluoromethanesulfonamides. Bioorg Med Chem Lett15:5192-6 (2005) 
 
Carbonic anhydrase 2
Name:Carbonic anhydrase 2
Type:Enzyme
Mol. Mass.:29250.71
Organism:Homo sapiens (Human)
Description:P00918
Residue:260
BDBM50370690
NameBDBM50370690
Synonyms:CHEMBL1628081
TypeSmall organic molecule
Emp. Form.C19H25NO3S
Mol. Mass.347.472
SMILESC[C@]12CC[C@H]3[C@@H](CCc4cc(CS(N)(=O)=O)ccc34)[C@@H]1CCC2=O