Reaction Details
TargetCarbonic anhydrase 1
LigandBDBM50175001
Substrate/Competitorn/a
Meas. Tech.ChEMBL_326094 (CHEMBL869401)
Ki 1130±n/a nM
Citation Cecchi, ATaylor, SDLiu, YHill, BVullo, DScozzafava, ASupuran, CT Carbonic anhydrase inhibitors: inhibition of the human isozymes I, II, VA, and IX with a library of substituted difluoromethanesulfonamides. Bioorg Med Chem Lett15:5192-6 (2005) 
 
Carbonic anhydrase 1
Name:Carbonic anhydrase 1
Type:Enzyme
Mol. Mass.:28873.37
Organism:Homo sapiens (Human)
Description:P00915
Residue:261
BDBM50175001
NameBDBM50175001
Synonyms:4-nitrophenyl-difluoromethanesulfonamide | CHEMBL370159
TypeSmall organic molecule
Emp. Form.C7H6F2N2O4S
Mol. Mass.252.195
SMILESNS(=O)(=O)C(F)(F)c1ccc(cc1)[N+]([O-])=O