Reaction Details
TargetSodium-dependent dopamine transporter
LigandBDBM50175151
Substrate/Competitorn/a
Meas. Tech.ChEMBL_326607 (CHEMBL863450)
Ki 6.22±n/a nM
Citation Grundt, PKopajtic, TAKatz, JLNewman, AH N-8-Substituted benztropinamine analogs as selective dopamine transporter ligands. Bioorg Med Chem Lett15:5419-23 (2005) 
 
Sodium-dependent dopamine transporter
Name:Sodium-dependent dopamine transporter
Type:Multi-pass membrane protein
Mol. Mass.:68749.45
Organism:Rattus norvegicus (rat)
Description:P23977
Residue:619
BDBM50175151
NameBDBM50175151
Synonyms:3-(3-(bis(4-fluorophenyl)methoxy)-8-aza-bicyclo[3.2.1]octan-8-yl)-N-phenylpropanamide CHEMBL199004
TypeSmall organic molecule
Emp. Form.C29H30F2N2O2
Mol. Mass.476.5575
SMILESFc1ccc(cc1)C(OC1CC2CCC(C1)N2CCC(=O)Nc1ccccc1)c1ccc(F)cc1