Reaction Details
TargetCannabinoid receptor 2
LigandBDBM50175106
Substrate/Competitorn/a
Meas. Tech.ChEMBL_328733 (CHEMBL863908)
Ki>10000±n/a nM
Citation Urbani, PCavallo, PCascio, MGBuonerba, MDe Martino, GDi Marzo, VSaturnino, C New metabolically stable fatty acid amide ligands of cannabinoid receptors: Synthesis and receptor affinity studies. Bioorg Med Chem Lett16:138-41 (2005) 
 
Cannabinoid receptor 2
Name:Cannabinoid receptor 2
Type:G Protein-Coupled Receptor (GPCR)
Mol. Mass.:39690.94
Organism:Homo sapiens (Human)
Description:P34972
Residue:360
BDBM50175106
NameBDBM50175106
Synonyms:CHEMBL202339 | N-(4-methoxyphenethyl)undec-10-enamide
TypeSmall organic molecule
Emp. Form.C20H31NO2
Mol. Mass.317.4656
SMILESCOc1ccc(CCNC(=O)CCCCCCCCC=C)cc1