Reaction Details
TargetCannabinoid receptor 2
LigandBDBM50175109
Substrate/Competitorn/a
Meas. Tech.ChEMBL_328733 (CHEMBL863908)
Ki>10000±n/a nM
Citation Urbani, PCavallo, PCascio, MGBuonerba, MDe Martino, GDi Marzo, VSaturnino, C New metabolically stable fatty acid amide ligands of cannabinoid receptors: Synthesis and receptor affinity studies. Bioorg Med Chem Lett16:138-41 (2005) 
 
Cannabinoid receptor 2
Name:Cannabinoid receptor 2
Type:G Protein-Coupled Receptor (GPCR)
Mol. Mass.:39690.94
Organism:Homo sapiens (Human)
Description:P34972
Residue:360
BDBM50175109
NameBDBM50175109
Synonyms:CHEMBL199649 | N-(2,4-dimethoxyphenethyl)oleamide
TypeSmall organic molecule
Emp. Form.C28H47NO3
Mol. Mass.445.6777
SMILESCCCCCCCC\C=C/CCCCCCCC(=O)NCCc1ccc(OC)cc1OC