Reaction Details
TargetCannabinoid receptor 2
LigandBDBM50175121
Substrate/Competitorn/a
Meas. Tech.ChEMBL_328733 (CHEMBL863908)
Ki 5100±n/a nM
Citation Urbani, PCavallo, PCascio, MGBuonerba, MDe Martino, GDi Marzo, VSaturnino, C New metabolically stable fatty acid amide ligands of cannabinoid receptors: Synthesis and receptor affinity studies. Bioorg Med Chem Lett16:138-41 (2005) 
 
Cannabinoid receptor 2
Name:Cannabinoid receptor 2
Type:G Protein-Coupled Receptor (GPCR)
Mol. Mass.:39690.94
Organism:Homo sapiens (Human)
Description:P34972
Residue:360
BDBM50175121
NameBDBM50175121
Synonyms:(E)-N-(4-methoxyphenethyl)undec-2-enamide | CHEMBL198182
TypeSmall organic molecule
Emp. Form.C20H31NO2
Mol. Mass.317.4656
SMILESCCCCCCCC\C=C\C(=O)NCCc1ccc(OC)cc1