Reaction Details
TargetCannabinoid receptor 1
LigandBDBM50175117
Substrate/Competitorn/a
Meas. Tech.ChEMBL_328734 (CHEMBL863909)
Ki 600±n/a nM
Citation Urbani, PCavallo, PCascio, MGBuonerba, MDe Martino, GDi Marzo, VSaturnino, C New metabolically stable fatty acid amide ligands of cannabinoid receptors: Synthesis and receptor affinity studies. Bioorg Med Chem Lett16:138-41 (2005) 
 
Cannabinoid receptor 1
Name:Cannabinoid receptor 1
Type:G Protein-Coupled Receptor (GPCR)
Mol. Mass.:52868.96
Organism:Homo sapiens (Human)
Description:P21554
Residue:472
BDBM50175117
NameBDBM50175117
Synonyms:CHEMBL372530 | N-(4-methoxybenzyl)oleamide
TypeSmall organic molecule
Emp. Form.C26H43NO2
Mol. Mass.401.6251
SMILESCCCCCCCC\C=C/CCCCCCCC(=O)NCc1ccc(OC)cc1