Reaction Details
TargetFatty-acid amide hydrolase 1 [30-579]
LigandBDBM50175120
Substrate/Competitorn/a
Meas. Tech.ChEMBL_328735 (CHEMBL863910)
IC50>25000±n/a nM
Citation Urbani, PCavallo, PCascio, MGBuonerba, MDe Martino, GDi Marzo, VSaturnino, C New metabolically stable fatty acid amide ligands of cannabinoid receptors: Synthesis and receptor affinity studies. Bioorg Med Chem Lett16:138-41 (2005) 
 
Fatty-acid amide hydrolase 1 [30-579]
Name:Fatty-acid amide hydrolase 1 [30-579]
Type:Single-pass membrane protein; homodimer
Mol. Mass.:60474.00
Organism:Rattus norvegicus (rat)
Description:P97612 (aa 30-579)
Residue:550
BDBM50175120
NameBDBM50175120
Synonyms:CHEMBL199702 | N-(4-methoxyphenethyl)oleamide
TypeSmall organic molecule
Emp. Form.C27H45NO2
Mol. Mass.415.6517
SMILESCCCCCCCC\C=C/CCCCCCCC(=O)NCCc1ccc(OC)cc1