Reaction Details
TargetCannabinoid receptor 2
LigandBDBM50175127
Substrate/Competitorn/a
Meas. Tech.ChEMBL_328733 (CHEMBL863908)
Ki>10000±n/a nM
Citation Urbani, PCavallo, PCascio, MGBuonerba, MDe Martino, GDi Marzo, VSaturnino, C New metabolically stable fatty acid amide ligands of cannabinoid receptors: Synthesis and receptor affinity studies. Bioorg Med Chem Lett16:138-41 (2005) 
 
Cannabinoid receptor 2
Name:Cannabinoid receptor 2
Type:G Protein-Coupled Receptor (GPCR)
Mol. Mass.:39690.94
Organism:Homo sapiens (Human)
Description:P34972
Residue:360
BDBM50175127
NameBDBM50175127
Synonyms:CHEMBL199317 | N-(2,4-dimethoxyphenethyl)undec-10-enamide
TypeSmall organic molecule
Emp. Form.C21H33NO3
Mol. Mass.347.4916
SMILESCOc1ccc(CCNC(=O)CCCCCCCCC=C)c(OC)c1