Reaction Details
TargetCannabinoid receptor 2
LigandBDBM50175126
Substrate/Competitorn/a
Meas. Tech.ChEMBL_328733 (CHEMBL863908)
Ki 4000±n/a nM
Citation Urbani, PCavallo, PCascio, MGBuonerba, MDe Martino, GDi Marzo, VSaturnino, C New metabolically stable fatty acid amide ligands of cannabinoid receptors: Synthesis and receptor affinity studies. Bioorg Med Chem Lett16:138-41 (2005) 
 
Cannabinoid receptor 2
Name:Cannabinoid receptor 2
Type:G Protein-Coupled Receptor (GPCR)
Mol. Mass.:39690.94
Organism:Homo sapiens (Human)
Description:P34972
Residue:360
BDBM50175126
NameBDBM50175126
Synonyms:(5Z,8Z,11Z,14Z)-N-(2,4-dimethoxybenzyl)icosa-5,8,11,14-tetraenamide | CHEMBL197601
TypeSmall organic molecule
Emp. Form.C29H43NO3
Mol. Mass.453.6566
SMILESCCCCC\C=C/C\C=C/C\C=C/C\C=C/CCCC(=O)NCc1ccc(OC)cc1OC