Reaction Details
TargetCannabinoid receptor 1
LigandBDBM50175122
Substrate/Competitorn/a
Meas. Tech.ChEMBL_328732 (CHEMBL863907)
Ki 1600±n/a nM
Citation Urbani, PCavallo, PCascio, MGBuonerba, MDe Martino, GDi Marzo, VSaturnino, C New metabolically stable fatty acid amide ligands of cannabinoid receptors: Synthesis and receptor affinity studies. Bioorg Med Chem Lett16:138-41 (2005) 
 
Cannabinoid receptor 1
Name:Cannabinoid receptor 1
Type:G Protein-Coupled Receptor (GPCR)
Mol. Mass.:52868.96
Organism:Homo sapiens (Human)
Description:P21554
Residue:472
BDBM50175122
NameBDBM50175122
Synonyms:CHEMBL199960 | N-(4-methoxyphenyl)oleamide
TypeSmall organic molecule
Emp. Form.C25H41NO2
Mol. Mass.387.5985
SMILESCCCCCCCC\C=C/CCCCCCCC(=O)Nc1ccc(OC)cc1