Reaction Details
TargetCannabinoid receptor 1
LigandBDBM50175114
Substrate/Competitorn/a
Meas. Tech.ChEMBL_328732 (CHEMBL863907)
Ki 400±n/a nM
Citation Urbani, PCavallo, PCascio, MGBuonerba, MDe Martino, GDi Marzo, VSaturnino, C New metabolically stable fatty acid amide ligands of cannabinoid receptors: Synthesis and receptor affinity studies. Bioorg Med Chem Lett16:138-41 (2005) 
 
Cannabinoid receptor 1
Name:Cannabinoid receptor 1
Type:G Protein-Coupled Receptor (GPCR)
Mol. Mass.:52868.96
Organism:Homo sapiens (Human)
Description:P21554
Residue:472
BDBM50175114
NameBDBM50175114
Synonyms:(5Z,8Z,11Z,14Z)-1-(4-(3,4-dimethylphenyl)piperazin-1-yl)icosa-5,8,11,14-tetraen-1-one | CHEMBL373223
TypeSmall organic molecule
Emp. Form.C32H48N2O
Mol. Mass.476.7363
SMILESCCCCC\C=C/C\C=C/C\C=C/C\C=C/CCCC(=O)N1CCN(CC1)c1ccc(C)c(C)c1