Reaction Details
TargetCannabinoid receptor 1
LigandBDBM50175133
Substrate/Competitorn/a
Meas. Tech.ChEMBL_328732 (CHEMBL863907)
Ki>10000±n/a nM
Citation Urbani, PCavallo, PCascio, MGBuonerba, MDe Martino, GDi Marzo, VSaturnino, C New metabolically stable fatty acid amide ligands of cannabinoid receptors: Synthesis and receptor affinity studies. Bioorg Med Chem Lett16:138-41 (2005) 
 
Cannabinoid receptor 1
Name:Cannabinoid receptor 1
Type:G Protein-Coupled Receptor (GPCR)
Mol. Mass.:52868.96
Organism:Homo sapiens (Human)
Description:P21554
Residue:472
BDBM50175133
NameBDBM50175133
Synonyms:(5Z,8Z,11Z,14Z)-N-(3,5-dimethoxyphenethyl)icosa-5,8,11,14-tetraenamide | CHEMBL383813
TypeSmall organic molecule
Emp. Form.C30H45NO3
Mol. Mass.467.6832
SMILESCCCCC\C=C/C\C=C/C\C=C/C\C=C/CCCC(=O)NCCc1cc(OC)cc(OC)c1