Reaction Details
TargetCannabinoid receptor 2
LigandBDBM50175131
Substrate/Competitorn/a
Meas. Tech.ChEMBL_328733 (CHEMBL863908)
Ki>10000±n/a nM
Citation Urbani, PCavallo, PCascio, MGBuonerba, MDe Martino, GDi Marzo, VSaturnino, C New metabolically stable fatty acid amide ligands of cannabinoid receptors: Synthesis and receptor affinity studies. Bioorg Med Chem Lett16:138-41 (2005) 
 
Cannabinoid receptor 2
Name:Cannabinoid receptor 2
Type:G Protein-Coupled Receptor (GPCR)
Mol. Mass.:39690.94
Organism:Homo sapiens (Human)
Description:P34972
Residue:360
BDBM50175131
NameBDBM50175131
Synonyms:CHEMBL201776 | N-(4-methoxyphenyl)undec-10-enamide
TypeSmall organic molecule
Emp. Form.C18H27NO2
Mol. Mass.289.4125
SMILESCOc1ccc(NC(=O)CCCCCCCCC=C)cc1