Reaction Details
TargetCannabinoid receptor 2
LigandBDBM50175135
Substrate/Competitorn/a
Meas. Tech.ChEMBL_328733 (CHEMBL863908)
Ki>10000±n/a nM
Citation Urbani, PCavallo, PCascio, MGBuonerba, MDe Martino, GDi Marzo, VSaturnino, C New metabolically stable fatty acid amide ligands of cannabinoid receptors: Synthesis and receptor affinity studies. Bioorg Med Chem Lett16:138-41 (2005) 
 
Cannabinoid receptor 2
Name:Cannabinoid receptor 2
Type:G Protein-Coupled Receptor (GPCR)
Mol. Mass.:39690.94
Organism:Homo sapiens (Human)
Description:P34972
Residue:360
BDBM50175135
NameBDBM50175135
Synonyms:CHEMBL425575 | N-(4-methoxyphenyl)docos-13-enamide
TypeSmall organic molecule
Emp. Form.C29H49NO2
Mol. Mass.443.7049
SMILESCCCCCCCC\C=C/CCCCCCCCCCCC(=O)Nc1ccc(OC)cc1