Reaction Details
TargetCannabinoid receptor 1
LigandBDBM50175115
Substrate/Competitorn/a
Meas. Tech.ChEMBL_328732 (CHEMBL863907)
Ki>10000±n/a nM
Citation Urbani, PCavallo, PCascio, MGBuonerba, MDe Martino, GDi Marzo, VSaturnino, C New metabolically stable fatty acid amide ligands of cannabinoid receptors: Synthesis and receptor affinity studies. Bioorg Med Chem Lett16:138-41 (2005) 
 
Cannabinoid receptor 1
Name:Cannabinoid receptor 1
Type:G Protein-Coupled Receptor (GPCR)
Mol. Mass.:52868.96
Organism:Homo sapiens (Human)
Description:P21554
Residue:472
BDBM50175115
NameBDBM50175115
Synonyms:CHEMBL199786 | N-(4-methoxyphenethyl)docos-13-enamide
TypeSmall organic molecule
Emp. Form.C31H53NO2
Mol. Mass.471.758
SMILESCCCCCCCC\C=C/CCCCCCCCCCCC(=O)NCCc1ccc(OC)cc1