Reaction Details
TargetCannabinoid receptor 1
LigandBDBM50175120
Substrate/Competitorn/a
Meas. Tech.ChEMBL_328734 (CHEMBL863909)
Ki 300±n/a nM
Citation Urbani, PCavallo, PCascio, MGBuonerba, MDe Martino, GDi Marzo, VSaturnino, C New metabolically stable fatty acid amide ligands of cannabinoid receptors: Synthesis and receptor affinity studies. Bioorg Med Chem Lett16:138-41 (2005) 
 
Cannabinoid receptor 1
Name:Cannabinoid receptor 1
Type:G Protein-Coupled Receptor (GPCR)
Mol. Mass.:52868.96
Organism:Homo sapiens (Human)
Description:P21554
Residue:472
BDBM50175120
NameBDBM50175120
Synonyms:CHEMBL199702 | N-(4-methoxyphenethyl)oleamide
TypeSmall organic molecule
Emp. Form.C27H45NO2
Mol. Mass.415.6517
SMILESCCCCCCCC\C=C/CCCCCCCC(=O)NCCc1ccc(OC)cc1