Reaction Details
TargetCannabinoid receptor 1
LigandBDBM50175138
Substrate/Competitorn/a
Meas. Tech.ChEMBL_328732 (CHEMBL863907)
Ki 500±n/a nM
Citation Urbani, PCavallo, PCascio, MGBuonerba, MDe Martino, GDi Marzo, VSaturnino, C New metabolically stable fatty acid amide ligands of cannabinoid receptors: Synthesis and receptor affinity studies. Bioorg Med Chem Lett16:138-41 (2005) 
 
Cannabinoid receptor 1
Name:Cannabinoid receptor 1
Type:G Protein-Coupled Receptor (GPCR)
Mol. Mass.:52868.96
Organism:Homo sapiens (Human)
Description:P21554
Residue:472
BDBM50175138
NameBDBM50175138
Synonyms:(5Z,8Z,11Z,14Z)-N-(2,5-dimethoxybenzyl)icosa-5,8,11,14-tetraenamide | CHEMBL381634
TypeSmall organic molecule
Emp. Form.C29H43NO3
Mol. Mass.453.6566
SMILESCCCCC\C=C/C\C=C/C\C=C/C\C=C/CCCC(=O)NCc1cc(OC)ccc1OC