Reaction Details
TargetCarbonic anhydrase 1
LigandBDBM10883
Substrate/Competitorn/a
Meas. Tech.ChEMBL_329207 (CHEMBL865817)
Ki 1200±n/a nM
Citation Di Fiore, APedone, CD'Ambrosio, KScozzafava, ADe Simone, GSupuran, CT Carbonic anhydrase inhibitors: Valdecoxib binds to a different active site region of the human isoform II as compared to the structurally related cyclooxygenase II"selective" inhibitor celecoxib. Bioorg Med Chem Lett16:437-42 (2005) 
 
Carbonic anhydrase 1
Name:Carbonic anhydrase 1
Type:Enzyme
Mol. Mass.:28873.37
Organism:Homo sapiens (Human)
Description:P00915
Residue:261
BDBM10883
NameBDBM10883
Synonyms:4,5-dichlorobenzene-1,3-disulfonamide Dichlorophenamide Dichlorophenamide, DCP US10172837, Dichlorphenamide | sulfonamide 4
TypeSmall organic molecule
Emp. Form.C6H6Cl2N2O4S2
Mol. Mass.305.159
SMILESNS(=O)(=O)c1cc(Cl)c(Cl)c(c1)S(N)(=O)=O