Reaction Details
TargetCannabinoid receptor 2
LigandBDBM50180041
Substrate/Competitorn/a
Meas. Tech.ChEMBL_329835 (CHEMBL854384)
Ki 201±n/a nM
Citation Stern, EMuccioli, GGMillet, RGoossens, JFFarce, AChavatte, PPoupaert, JHLambert, DMDepreux, PHénichart, JP Novel 4-oxo-1,4-dihydroquinoline-3-carboxamide derivatives as new CB2 cannabinoid receptors agonists: synthesis, pharmacological properties and molecular modeling. J Med Chem49:70-9 (2006) 
 
Cannabinoid receptor 2
Name:Cannabinoid receptor 2
Type:G Protein-Coupled Receptor (GPCR)
Mol. Mass.:39690.94
Organism:Homo sapiens (Human)
Description:P34972
Residue:360
BDBM50180041
NameBDBM50180041
Synonyms:CHEMBL201175 | N3-(phenethyl)-4-oxo-1-pentyl-1,4-dihydroquinoline-3-carboxamide
TypeSmall organic molecule
Emp. Form.C23H26N2O2
Mol. Mass.362.4647
SMILESCCCCCn1cc(C(=O)NCCc2ccccc2)c(=O)c2ccccc12