Reaction Details
Target3-oxoacyl-[acyl-carrier-protein] synthase 2
LigandBDBM50180103
Substrate/Competitorn/a
Meas. Tech.ChEMBL_330092 (CHEMBL863390)
IC50>1000000±n/a nM
Citation Kim, PZhang, YMShenoy, GNguyen, QABoshoff, HIManjunatha, UHGoodwin, MBLonsdale, JPrice, ACMiller, DJDuncan, KWhite, SWRock, COBarry, CEDowd, CS Structure-activity relationships at the 5-position of thiolactomycin: an intact (5R)-isoprene unit is required for activity against the condensing enzymes from Mycobacterium tuberculosis and Escherichia coli. J Med Chem49:159-71 (2006) 
 
3-oxoacyl-[acyl-carrier-protein] synthase 2
Name:3-oxoacyl-[acyl-carrier-protein] synthase 2
Type:PROTEIN
Mol. Mass.:44268.74
Organism:Mycobacterium tuberculosis
Description:ChEMBL_330092
Residue:417
BDBM50180103
NameBDBM50180103
Synonyms:3,5-dimethyl-5-heptyl-4-hydroxy-5H-thiophen-2-one | CHEMBL200240
TypeSmall organic molecule
Emp. Form.C13H22O2S
Mol. Mass.242.378
SMILESCCCCCCCC1(C)SC(=O)C(C)C1=O