Reaction Details
Target3-oxoacyl-[acyl-carrier-protein] synthase 3
LigandBDBM50180116
Substrate/Competitorn/a
Meas. Tech.ChEMBL_330093 (CHEMBL863391)
IC50>1000000±n/a nM
Citation Kim, PZhang, YMShenoy, GNguyen, QABoshoff, HIManjunatha, UHGoodwin, MBLonsdale, JPrice, ACMiller, DJDuncan, KWhite, SWRock, COBarry, CEDowd, CS Structure-activity relationships at the 5-position of thiolactomycin: an intact (5R)-isoprene unit is required for activity against the condensing enzymes from Mycobacterium tuberculosis and Escherichia coli. J Med Chem49:159-71 (2006) 
 
3-oxoacyl-[acyl-carrier-protein] synthase 3
Name:3-oxoacyl-[acyl-carrier-protein] synthase 3
Type:Enzyme
Mol. Mass.:34865.07
Organism:Mycobacterium tuberculosis
Description:P9WNG3
Residue:335
BDBM50180116
NameBDBM50180116
Synonyms:3,5-dimethyl-4-hydroxy-5-nonyl-5H-thiophen-2-one | CHEMBL200363
TypeSmall organic molecule
Emp. Form.C15H26O2S
Mol. Mass.270.431
SMILESCCCCCCCCCC1(C)SC(=O)C(C)C1=O