Reaction Details
Target3-oxoacyl-[acyl-carrier-protein] synthase 3
LigandBDBM50180117
Substrate/Competitorn/a
Meas. Tech.ChEMBL_330090 (CHEMBL863388)
IC50>1000000±n/a nM
Citation Kim, PZhang, YMShenoy, GNguyen, QABoshoff, HIManjunatha, UHGoodwin, MBLonsdale, JPrice, ACMiller, DJDuncan, KWhite, SWRock, COBarry, CEDowd, CS Structure-activity relationships at the 5-position of thiolactomycin: an intact (5R)-isoprene unit is required for activity against the condensing enzymes from Mycobacterium tuberculosis and Escherichia coli. J Med Chem49:159-71 (2006) 
 
3-oxoacyl-[acyl-carrier-protein] synthase 3
Name:3-oxoacyl-[acyl-carrier-protein] synthase 3
Type:Enzyme
Mol. Mass.:33506.68
Organism:Escherichia coli
Description:C3TDZ2
Residue:317
BDBM50180117
NameBDBM50180117
Synonyms:3,5-dimethyl-4-hydroxy-5-(3-methylbenzyl)-5H-thiophen-2-one | CHEMBL371660
TypeSmall organic molecule
Emp. Form.C14H16O2S
Mol. Mass.248.341
SMILESCC1C(=O)SC(C)(Cc2cccc(C)c2)C1=O