Reaction Details
Target3-oxoacyl-[acyl-carrier-protein] synthase 2
LigandBDBM50180114
Substrate/Competitorn/a
Meas. Tech.ChEMBL_330092 (CHEMBL863390)
IC50>100000±n/a nM
Citation Kim, PZhang, YMShenoy, GNguyen, QABoshoff, HIManjunatha, UHGoodwin, MBLonsdale, JPrice, ACMiller, DJDuncan, KWhite, SWRock, COBarry, CEDowd, CS Structure-activity relationships at the 5-position of thiolactomycin: an intact (5R)-isoprene unit is required for activity against the condensing enzymes from Mycobacterium tuberculosis and Escherichia coli. J Med Chem49:159-71 (2006) 
 
3-oxoacyl-[acyl-carrier-protein] synthase 2
Name:3-oxoacyl-[acyl-carrier-protein] synthase 2
Type:PROTEIN
Mol. Mass.:44268.74
Organism:Mycobacterium tuberculosis
Description:ChEMBL_330092
Residue:417
BDBM50180114
NameBDBM50180114
Synonyms:3,5-dimethyl-5-((2E,6E)-3,7,11-trimethyldodeca-2,6,10-trienyl)-4-hydroxy-5H-thiophen-2-one | CHEMBL199771
TypeSmall organic molecule
Emp. Form.C21H32O2S
Mol. Mass.348.543
SMILES[#6]-[#6]-1-[#6](=O)-[#16]C([#6])([#6]\[#6]=[#6](/[#6])-[#6]-[#6]\[#6]=[#6](/[#6])-[#6]-[#6]\[#6]=[#6](\[#6])-[#6])[#6]-1=O