Reaction Details
Target3-oxoacyl-[acyl-carrier-protein] synthase 3
LigandBDBM50180135
Substrate/Competitorn/a
Meas. Tech.ChEMBL_330093 (CHEMBL863391)
IC50 50000±n/a nM
Citation Kim, PZhang, YMShenoy, GNguyen, QABoshoff, HIManjunatha, UHGoodwin, MBLonsdale, JPrice, ACMiller, DJDuncan, KWhite, SWRock, COBarry, CEDowd, CS Structure-activity relationships at the 5-position of thiolactomycin: an intact (5R)-isoprene unit is required for activity against the condensing enzymes from Mycobacterium tuberculosis and Escherichia coli. J Med Chem49:159-71 (2006) 
 
3-oxoacyl-[acyl-carrier-protein] synthase 3
Name:3-oxoacyl-[acyl-carrier-protein] synthase 3
Type:Enzyme
Mol. Mass.:34865.07
Organism:Mycobacterium tuberculosis
Description:P9WNG3
Residue:335
BDBM50180135
NameBDBM50180135
Synonyms:(R)-3,5-dimethyl-4-hydroxy-5-((1E,3E)-2-methylpenta-1,3-dienyl)-5H-thiophen-2-one | CHEMBL382200
TypeSmall organic molecule
Emp. Form.C12H16O2S
Mol. Mass.224.319
SMILESC\C=C\C(\C)=C\[C@@]1(C)SC(=O)C(C)C1=O