Reaction Details
TargetMelanocortin receptor 4
LigandBDBM50181499
Substrate/Competitorn/a
Meas. Tech.ChEMBL_330392 (CHEMBL853044)
EC50 108±n/a nM
Citation Hogan, KPeluso, SGould, SParsons, IRyan, DWu, LVisiers, I Mapping the binding site of melanocortin 4 receptor agonists: a hydrophobic pocket formed by I3.28(125), I3.32(129), and I7.42(291) is critical for receptor activation. J Med Chem49:911-22 (2006) 
 
Melanocortin receptor 4
Name:Melanocortin receptor 4
Type:Enzyme
Mol. Mass.:36949.50
Organism:Homo sapiens (Human)
Description:P32245
Residue:332
BDBM50181499
NameBDBM50181499
Synonyms:CHEMBL438596 | c[Ser-Tyr-Thr-His-Dphe-Arg-Trp-Thr-Ile-Pro]
TypeSmall organic molecule
Emp. Form.C63H84N16O14
Mol. Mass.1289.4399
SMILESCC[C@@H](C)[C@H]1NC(=O)[C@H](NC(=O)[C@@H](Cc2c[nH]c3ccccc23)NC(=O)[C@H](CCCN=C(N)N)NC(=O)[C@@H](Cc2ccccc2)NC(=O)[C@H](Cc2cnc[nH]2)NC(=O)[C@@H](NC(=O)[C@H](Cc2ccc(O)cc2)NC(=O)[C@H](CO)NC(=O)[C@@H]2CCCN2C1=O)[C@@H](C)O)[C@@H](C)O