Reaction Details
TargetCarbonic anhydrase
LigandBDBM10886
Substrate/Competitorn/a
Meas. Tech.ChEMBL_347177 (CHEMBL862664)
Ki 287±n/a nM
Citation Nishimori, IVullo, DMinakuchi, TMorimoto, KOnishi, SScozzafava, ASupuran, CT Carbonic anhydrase inhibitors: cloning and sulfonamide inhibition studies of a carboxyterminal truncated alpha-carbonic anhydrase from Helicobacter pylori. Bioorg Med Chem Lett16:2182-8 (2006) 
 
Carbonic anhydrase
Name:Carbonic anhydrase
Type:Protein
Mol. Mass.:25517.77
Organism:Helicobacter pylori (strain G27)
Description:O24855
Residue:221
BDBM10886
NameBDBM10886
Synonyms:2-N-benzene-1,3,4-thiadiazole-2,5-disulfonamide Benzolamide CHEMBL73962
TypeSmall organic molecule
Emp. Form.C8H8N4O4S3
Mol. Mass.320.369
SMILESNS(=O)(=O)c1nnc(NS(=O)(=O)c2ccccc2)s1