Reaction Details
TargetAdenosine receptor A1
LigandBDBM50182964
Substrate/Competitorn/a
Meas. Tech.ChEMBL_350235 (CHEMBL866264)
Ki 87±n/a nM
Citation Zhu, RFrazier, CRLinden, JMacdonald, TL N6-ethyl-2-alkynyl NECAs, selective human A3 adenosine receptor agonists. Bioorg Med Chem Lett16:2416-8 (2006) 
 
Adenosine receptor A1
Name:Adenosine receptor A1
Type:G Protein-Coupled Receptor (GPCR)
Mol. Mass.:36520.92
Organism:Homo sapiens (Human)
Description:P30542
Residue:326
BDBM50182964
NameBDBM50182964
Synonyms:(2S,3S,4R,5R)-N-ethyl-5-(6-(ethylamino)-2-(hex-1-ynyl)-9H-purin-9-yl)-3,4-dihydroxy-tetrahydrofuran-2-carboxamide | CHEMBL204634
TypeSmall organic molecule
Emp. Form.C20H28N6O4
Mol. Mass.416.4741
SMILESCCCCC#Cc1nc(NCC)c2ncn([C@@H]3O[C@@H]([C@@H](O)[C@H]3O)C(=O)NCC)c2n1