Reaction Details
TargetAdenosine receptor A3
LigandBDBM50185941
Substrate/Competitorn/a
Meas. Tech.ChEMBL_351396 (CHEMBL870047)
Ki 185±n/a nM
Citation Gao, ZGDuong, HTSonina, TKim, SKVan Rompaey, PVan Calenbergh, SMamedova, LKim, HOKim, MJKim, AYLiang, BTJeong, LSJacobson, KA Orthogonal activation of the reengineered A3 adenosine receptor (neoceptor) using tailored nucleoside agonists. J Med Chem49:2689-702 (2006) 
 
Adenosine receptor A3
Name:Adenosine receptor A3
Type:G Protein-Coupled Receptor (GPCR)
Mol. Mass.:36197.32
Organism:Homo sapiens (Human)
Description:P0DMS8
Residue:318
BDBM50185941
NameBDBM50185941
Synonyms:(2S,3S,4R,5R)-5-(6-(3-iodobenzylamino)-9H-purin-9-yl)-3-(aminomethyl)-4-hydroxy-N-methyl-tetrahydrofuran-2-carboxamide | CHEMBL382812
TypeSmall organic molecule
Emp. Form.C19H22IN7O3
Mol. Mass.523.3276
SMILESCNC(=O)[C@H]1O[C@H]([C@H](O)[C@@H]1CN)n1cnc2c(NCc3cccc(I)c3)ncnc12