Reaction Details
TargetAdenosine receptor A3
LigandBDBM50185937
Substrate/Competitorn/a
Meas. Tech.ChEMBL_351398 (CHEMBL870052)
Ki 1370±n/a nM
Citation Gao, ZGDuong, HTSonina, TKim, SKVan Rompaey, PVan Calenbergh, SMamedova, LKim, HOKim, MJKim, AYLiang, BTJeong, LSJacobson, KA Orthogonal activation of the reengineered A3 adenosine receptor (neoceptor) using tailored nucleoside agonists. J Med Chem49:2689-702 (2006) 
 
Adenosine receptor A3
Name:Adenosine receptor A3
Type:G Protein-Coupled Receptor (GPCR)
Mol. Mass.:36197.32
Organism:Homo sapiens (Human)
Description:P0DMS8
Residue:318
BDBM50185937
NameBDBM50185937
Synonyms:3-azido-5-(6-(3-iodobenzylamino)purin-9-yl)-4-hydroxy-tetrahydro-furan-2-carboxylic acid methyl amide | CHEMBL377071
TypeSmall organic molecule
Emp. Form.C18H18IN9O3
Mol. Mass.535.2985
SMILESCNC(=O)[C@H]1O[C@H]([C@H](O)[C@@H]1N=[N+]=[N-])n1cnc2c(NCc3cccc(I)c3)ncnc12