Reaction Details
TargetAdenosine receptor A3
LigandBDBM50185936
Substrate/Competitorn/a
Meas. Tech.ChEMBL_351399 (CHEMBL868897)
Ki>10000±n/a nM
Citation Gao, ZGDuong, HTSonina, TKim, SKVan Rompaey, PVan Calenbergh, SMamedova, LKim, HOKim, MJKim, AYLiang, BTJeong, LSJacobson, KA Orthogonal activation of the reengineered A3 adenosine receptor (neoceptor) using tailored nucleoside agonists. J Med Chem49:2689-702 (2006) 
 
Adenosine receptor A3
Name:Adenosine receptor A3
Type:G Protein-Coupled Receptor (GPCR)
Mol. Mass.:36197.32
Organism:Homo sapiens (Human)
Description:P0DMS8
Residue:318
BDBM50185936
NameBDBM50185936
Synonyms:(2R,3R,4S,5S)-2-(6-(5-chloro-2-methoxybenzylamino)-9H-purin-9-yl)-4-(aminomethyl)-5-(hydroxymethyl)-tetrahydrofuran-3-ol | CHEMBL378069
TypeSmall organic molecule
Emp. Form.C19H23ClN6O4
Mol. Mass.434.877
SMILESCOc1ccc(Cl)cc1CNc1ncnc2n(cnc12)[C@@H]1O[C@H](CO)[C@@H](CN)[C@H]1O