Reaction Details
TargetBifunctional purine biosynthesis protein ATIC
LigandBDBM50005518
Substrate/Competitorn/a
Meas. Tech.ChEMBL_353451 (CHEMBL861363)
Ki>100000±n/a nM
Citation DeMartino, JKHwang, IXu, LWilson, IABoger, DL Discovery of a potent, nonpolyglutamatable inhibitor of glycinamide ribonucleotide transformylase. J Med Chem49:2998-3002 (2006) 
 
Bifunctional purine biosynthesis protein ATIC
Name:Bifunctional purine biosynthesis protein ATIC
Type:Protein
Mol. Mass.:64616.62
Organism:Homo sapiens (Human)
Description:P31939
Residue:592
BDBM50005518
NameBDBM50005518
Synonyms:(S)-2-(4-(2-((R)-2-amino-4-oxo-1,4,5,6,7,8-hexahydropyrido[2,3-d]pyrimidin-6-yl)ethyl)benzamido)pentanedioic acid (S)-2-{(R)-4-[2-((R)-2-Amino-4-oxo-3,4,5,6,7,8-hexahydro-pyrido[2,3-d]pyrimidin-6-yl)-ethyl]-benzoylamino}-pentanedioic acid (S)-2-{(S)-4-[2-(2-Amino-4-hydroxy-5,6,7,8-tetrahydro-pyrido[2,3-d]pyrimidin-6-yl)-ethyl]-benzoylamino}-pentanedioic acid (S)-2-{4-[2-(2-Amino-4-oxo-3,4,5,6,7,8-hexahydro-pyrido[2,3-d]pyrimidin-6-yl)-ethyl]-benzoylamino}-pentanedioic acid CHEMBL142806 | LOMETREXOL
TypeSmall organic molecule
Emp. Form.C21H25N5O6
Mol. Mass.443.4531
SMILESNc1nc2NCC(CCc3ccc(cc3)C(=O)N[C@@H](CCC(O)=O)C(O)=O)Cc2c(=O)[nH]1