Reaction Details
TargetTrifunctional purine biosynthetic protein adenosine-3
LigandBDBM50186739
Substrate/Competitorn/a
Meas. Tech.ChEMBL_353450 (CHEMBL861362)
Ki 130±n/a nM
Citation DeMartino, JKHwang, IXu, LWilson, IABoger, DL Discovery of a potent, nonpolyglutamatable inhibitor of glycinamide ribonucleotide transformylase. J Med Chem49:2998-3002 (2006) 
 
Trifunctional purine biosynthetic protein adenosine-3
Name:Trifunctional purine biosynthetic protein adenosine-3
Type:Protein
Mol. Mass.:107768.47
Organism:Homo sapiens (Human)
Description:P22102
Residue:1010
BDBM50186739
NameBDBM50186739
Synonyms:(2S)-2-(4-(6-(2,4-diamino-6-oxo-1,6-dihydropyrimidin-5-yl)-1,1,1-trifluoro-2-oxohexan-3-yl)benzamido)-4-(1H-tetrazol-5-yl)-butanoic acid | CHEMBL424683
TypeSmall organic molecule
Emp. Form.C22H24F3N9O5
Mol. Mass.551.4785
SMILESNc1nc(N)c(CCCC(C(=O)C(F)(F)F)c2ccc(cc2)C(=O)NC(CCc2nnn[nH]2)C(O)=O)c(=O)[nH]1