Reaction Details
TargetBifunctional purine biosynthesis protein ATIC
LigandBDBM50186740
Substrate/Competitorn/a
Meas. Tech.ChEMBL_353451 (CHEMBL861363)
Ki>100000±n/a nM
Citation DeMartino, JKHwang, IXu, LWilson, IABoger, DL Discovery of a potent, nonpolyglutamatable inhibitor of glycinamide ribonucleotide transformylase. J Med Chem49:2998-3002 (2006) 
 
Bifunctional purine biosynthesis protein ATIC
Name:Bifunctional purine biosynthesis protein ATIC
Type:Protein
Mol. Mass.:64616.62
Organism:Homo sapiens (Human)
Description:P31939
Residue:592
BDBM50186740
NameBDBM50186740
Synonyms:CHEMBL381706 | N-((1H-tetrazol-5-yl)methyl)-4-(6-(2,4-diamino-6-oxo-1,6-dihydropyrimidin-5-yl)-1,1,1-trifluoro-2-oxohexan-3-yl)benzamide
TypeSmall organic molecule
Emp. Form.C19H20F3N9O3
Mol. Mass.479.4158
SMILESNc1nc(N)c(CCCC(C(=O)C(F)(F)F)c2ccc(cc2)C(=O)NCc2nnn[nH]2)c(=O)[nH]1