Reaction Details
TargetTrifunctional purine biosynthetic protein adenosine-3
LigandBDBM24693
Substrate/Competitorn/a
Meas. Tech.ChEMBL_353450 (CHEMBL861362)
Ki 30±n/a nM
Citation DeMartino, JKHwang, IXu, LWilson, IABoger, DL Discovery of a potent, nonpolyglutamatable inhibitor of glycinamide ribonucleotide transformylase. J Med Chem49:2998-3002 (2006) 
 
Trifunctional purine biosynthetic protein adenosine-3
Name:Trifunctional purine biosynthetic protein adenosine-3
Type:Protein
Mol. Mass.:107768.47
Organism:Homo sapiens (Human)
Description:P22102
Residue:1010
BDBM24693
NameBDBM24693
Synonyms:10-CF3CO-DDACTHF (5) 2-({4-[6-(2,4-diamino-6-oxo-1,6-dihydropyrimidin-5-yl)-1,1,1-trifluoro-2-oxohexan-3-yl]phenyl}formamido)pentanedioic acid | CHEMBL379094
TypeSmall organic molecule
Emp. Form.C22H24F3N5O7
Mol. Mass.527.4505
SMILESNc1nc(N)c(CCCC(C(=O)C(F)(F)F)c2ccc(cc2)C(=O)NC(CCC(O)=O)C(O)=O)c(=O)[nH]1