Reaction Details
TargetFalcipain 2B
LigandBDBM50073850
Substrate/Competitorn/a
Meas. Tech.ChEMBL_356421 (CHEMBL867545)
IC50 5000±n/a nM
Citation Micale, NKozikowski, APEttari, RGrasso, SZappalà, MJeong, JJKumar, AHanspal, MChishti, AH Novel peptidomimetic cysteine protease inhibitors as potential antimalarial agents. J Med Chem49:3064-7 (2006) 
 
Falcipain 2B
Name:Falcipain 2B
Synonyms:n/a
Type:PROTEIN
Mol. Mass.:27119.28
Organism:Plasmodium falciparum
Description:ChEMBL_356421
Residue:241
BDBM50073850
NameBDBM50073850
TypeSmall organic molecule
Emp. Form.C22H26N2O4
Mol. Mass.382.4528
SMILESCC(C)[C@H](NC(=O)OCc1ccccc1)C(=O)NC(Cc1ccccc1)C=O