Reaction Details
TargetProteasome subunit beta type-5
LigandBDBM50370717
Substrate/Competitorn/a
Meas. Tech.ChEMBL_359171 (CHEMBL869330)
IC50 47±n/a nM
Citation Marastoni, MBaldisserotto, ATrapella, CGavioli, RTomatis, R P3 and P4 position analysis of vinyl ester pseudopeptide proteasome inhibitors. Bioorg Med Chem Lett16:3125-30 (2006) 
 
Proteasome subunit beta type-5
Name:Proteasome subunit beta type-5
Type:Protein
Mol. Mass.:28480.96
Organism:Homo sapiens (Human)
Description:n/a
Residue:263
BDBM50370717
NameBDBM50370717
Synonyms:EPOXOMYCIN | Epoxomicin
TypeSmall organic molecule
Emp. Form.C28H50N4O7
Mol. Mass.554.7192
SMILESCCC(C)C(NC(=O)C(C(C)CC)N(C)C(C)=O)C(=O)NC(C(C)O)C(=O)NC(CC(C)C)C(=O)C1(C)CO1