Reaction Details
TargetCarbonic anhydrase 2
LigandBDBM13055
Substrate/Competitorn/a
Meas. Tech.ChEMBL_362834 (CHEMBL854244)
Kd 25000±n/a nM
Citation Klinger, ALMcComsey, DFSmith-Swintosky, VShank, RPMaryanoff, BE Inhibition of carbonic anhydrase-II by sulfamate and sulfamide groups: an investigation involving direct thermodynamic binding measurements. J Med Chem49:3496-500 (2006) 
 
Carbonic anhydrase 2
Name:Carbonic anhydrase 2
Type:Enzyme
Mol. Mass.:29250.71
Organism:Homo sapiens (Human)
Description:P00918
Residue:260
BDBM13055
NameBDBM13055
Synonyms:CHEMBL283695 Topiramate Sulfamide Analogue 8 | amino-N-{[(1R,2S,6S,9R)-4,4,11,11-tetramethyl-3,5,7,10,12-pentaoxatricyclo[7.3.0.0^{2,6}]dodecan-6-yl]methyl}sulfonamide
TypeSmall organic molecule
Emp. Form.C12H22N2O7S
Mol. Mass.338.377
SMILESCC1(C)O[C@@H]2CO[C@@]3(CNS(N)(=O)=O)OC(C)(C)O[C@H]3[C@@H]2O1