Reaction Details
TargetTransient receptor potential cation channel subfamily V member 1
LigandBDBM50188657
Substrate/Competitorn/a
Meas. Tech.ChEMBL_364426 (CHEMBL870234)
IC50 0.3±n/a nM
Citation Ognyanov, VIBalan, CBannon, AWBo, YDominguez, CFotsch, CGore, VKKlionsky, LMa, VVQian, YXTamir, RWang, XXi, NXu, SZhu, DGavva, NRTreanor, JJNorman, MH Design of potent, orally available antagonists of the transient receptor potential vanilloid 1. Structure-activity relationships of 2-piperazin-1-yl-1H-benzimidazoles. J Med Chem49:3719-42 (2006) 
 
Transient receptor potential cation channel subfamily V member 1
Name:Transient receptor potential cation channel subfamily V member 1
Type:Transient Receptor
Mol. Mass.:94956.12
Organism:Rattus norvegicus (rat)
Description:O35433
Residue:838
BDBM50188657
NameBDBM50188657
Synonyms:(R)-methyl 5-Chloro-6-(3-methyl-4-(6-(trifluoromethyl)-4-(3,4,5-trifluorophenyl)-1H-benzo[d]imidazol-2-yl)piperazin-1-yl)nicotinate | CHEMBL439152
TypeSmall organic molecule
Emp. Form.C26H20ClF6N5O2
Mol. Mass.583.913
SMILESCOC(=O)c1cnc(N2CCN([C@H](C)C2)c2nc3c(cc(cc3[nH]2)C(F)(F)F)-c2cc(F)c(F)c(F)c2)c(Cl)c1